Target
Alpha-1A adrenergic receptor
Ligand
BDBM50020819
Substrate
Meas. Tech.
ChEBML_33549
EC50
25±n/a nM
Citation
 DeMarinis, RMLavanchy, PHieble, JPJim, KFMatthews, WD N-[2-hydroxy-5-[2-(methylamino)ethyl]phenyl]methanesulfonamide. A potent agonist which releases intracellular calcium by activation of alpha 1-adrenoceptors. J Med Chem 28:245-8 (1985)  
Target
Name:
Alpha-1A adrenergic receptor
Synonyms:
ADA1A_HUMAN ADRA1C Alpha 1A-adrenoceptor Alpha adrenergic receptor 1a Alpha-adrenergic receptor 1c adrenergic Alpha1 | adrenergic Alpha1C
Type:
Cell-surface receptors
Mol. Mass.:
51511.67
Organism:
Homo sapiens (Human)
Description:
P35348
Residue:
466
  
Inhibitor
Name:
BDBM50020819
Synonyms:
CHEMBL543126 | N-[2-Hydroxy-5-(2-methylamino-ethyl)-phenyl]-methanesulfonamide; hydrobromide
Type:
Small organic molecule
Emp. Form.:
C10H16N2O3S
Mol. Mass.:
244.311
SMILES:
CNCCc1ccc(O)c(NS(C)(=O)=O)c1
: