Target
Dihydrofolate reductase
Ligand
BDBM50026311
Substrate
Meas. Tech.
ChEMBL_54556 (CHEMBL664872)
Ki
5.2±n/a nM
Citation
 Kuyper, LFRoth, BBaccanari, DPFerone, RBeddell, CRChampness, JNStammers, DKDann, JGNorrington, FEBaker, DJ Receptor-based design of dihydrofolate reductase inhibitors: comparison of crystallographically determined enzyme binding with enzyme affinity in a series of carboxy-substituted trimethoprim analogues. J Med Chem 28:303-11 (1985)  
Target
Name:
Dihydrofolate reductase
Synonyms:
Dihydrofolate reductase (F31V) | dfrA17
Type:
Mol. Mass.:
17532.46
Organism:
Escherichia coli
Description:
Residue:
157
  
Inhibitor
Name:
BDBM50026311
Synonyms:
4-[4-(2,4-Diamino-pyrimidin-5-ylmethyl)-2,6-dimethoxy-phenoxy]-butyric acid | CHEMBL320596
Type:
Small organic molecule
Emp. Form.:
C17H22N4O5
Mol. Mass.:
362.3804
SMILES:
COc1cc(Cc2cnc(N)nc2N)cc(OC)c1OCCCC(O)=O
: