Target
Dihydrofolate reductase
Ligand
BDBM50026309
Substrate
Meas. Tech.
ChEMBL_54542 (CHEMBL664859)
Ki
2.3±n/a nM
Citation
 Kuyper, LFRoth, BBaccanari, DPFerone, RBeddell, CRChampness, JNStammers, DKDann, JGNorrington, FEBaker, DJ Receptor-based design of dihydrofolate reductase inhibitors: comparison of crystallographically determined enzyme binding with enzyme affinity in a series of carboxy-substituted trimethoprim analogues. J Med Chem 28:303-11 (1985)  
Target
Name:
Dihydrofolate reductase
Synonyms:
Dihydrofolate reductase (F31V) | dfrA17
Type:
Mol. Mass.:
17532.46
Organism:
Escherichia coli
Description:
Residue:
157
  
Inhibitor
Name:
BDBM50026309
Synonyms:
4-[4-(2,4-Diamino-pyrimidin-5-ylmethyl)-2,6-dimethoxy-phenoxy]-butyric acid ethyl ester TCMDC-137899
Type:
Small organic molecule
Emp. Form.:
C19H26N4O5
Mol. Mass.:
390.4335
SMILES:
CCOC(=O)CCCOc1c(OC)cc(Cc2cnc(N)nc2N)cc1OC
: