Target
Angiotensin-converting enzyme
Ligand
BDBM50020836
Substrate
Meas. Tech.
ChEBML_34797
IC50
0.100±n/a nM
Citation
 Menard, PRSuh, JTJones, HLoev, BNeiss, ESWilde, JSchwab, AMann, WS Angiotensin converting enzyme inhibitors. (Mercaptoaroyl)amino acids. J Med Chem 28:328-32 (1985)  
Target
Name:
Angiotensin-converting enzyme
Synonyms:
3.2.1.- ACE Angiotensin-converting enzyme, soluble form DCP1 Kininase II
Type:
Mol. Mass.:
150405.15
Organism:
Oryctolagus cuniculus
Description:
Residue:
1310
  
Inhibitor
Name:
BDBM50020836
Synonyms:
CHEMBL115153 | N-Carboxymethyl-N-cyclopentyl-phthalamic acid
Type:
Small organic molecule
Emp. Form.:
C15H17NO5
Mol. Mass.:
291.2992
SMILES:
OC(=O)CN(C1CCCC1)C(=O)c1ccccc1C(O)=O
: