Target
Angiotensin-converting enzyme
Ligand
BDBM50020838
Substrate
Meas. Tech.
ChEBML_34797
IC50
0.028±n/a nM
Citation
 Menard, PRSuh, JTJones, HLoev, BNeiss, ESWilde, JSchwab, AMann, WS Angiotensin converting enzyme inhibitors. (Mercaptoaroyl)amino acids. J Med Chem 28:328-32 (1985)  
Target
Name:
Angiotensin-converting enzyme
Synonyms:
3.2.1.- ACE Angiotensin-converting enzyme, soluble form DCP1 Kininase II
Type:
Mol. Mass.:
150405.15
Organism:
Oryctolagus cuniculus
Description:
Residue:
1310
  
Inhibitor
Name:
BDBM50020838
Synonyms:
CHEMBL323879 | [(3-Acetylsulfanyl-benzoyl)-cyclopentyl-amino]-acetic acid
Type:
Small organic molecule
Emp. Form.:
C16H19NO4S
Mol. Mass.:
321.391
SMILES:
CC(=O)Sc1cccc(c1)C(=O)N(CC(O)=O)C1CCCC1
: