Target
Adenosylhomocysteinase
Ligand
BDBM50088426
Substrate
Meas. Tech.
ChEBML_197214
Ki
110±n/a nM
Citation
 Houston, DMDolence, EKKeller, BTPatel-Thombre, UBorchardt, RT Potential inhibitors of S-adenosylmethionine-dependent methyltransferases. 9. 2',3'-Dialdehyde derivatives of carbocyclic purine nucleosides as inhibitors of S-adenosylhomocysteine hydrolase. J Med Chem 28:471-7 (1985)  
Target
Name:
Adenosylhomocysteinase
Synonyms:
AHCY SAHH | SAHH_HUMAN
Type:
PROTEIN
Mol. Mass.:
47714.06
Organism:
Homo sapiens (Human)
Description:
ChEMBL_1507791
Residue:
432
  
Inhibitor
Name:
BDBM50088426
Synonyms:
(1R,2S,3R,5R)-3-(6-amino-9H-purin-9-yl)-5-(hydroxymethyl)cyclopentane-1,2-diol CHEMBL49935
Type:
Small organic molecule
Emp. Form.:
C11H15N5O3
Mol. Mass.:
265.2685
SMILES:
Nc1ncnc2n(cnc12)[C@@H]1C[C@H](CO)[C@@H](O)[C@H]1O
: