Target
Adenosine receptor A2a
Ligand
BDBM82010
Substrate
Meas. Tech.
ChEBML_27639
Ki
50±n/a nM
Citation
 Daly, JWPadgett, WShamim, MTButts-Lamb, PWaters, J 1,3-Dialkyl-8-(p-sulfophenyl)xanthines: potent water-soluble antagonists for A1- and A2-adenosine receptors. J Med Chem 28:487-92 (1985)  
Target
Name:
Adenosine receptor A2a
Synonyms:
AA2AR_CAVPO ADORA2A | Adenosine A2a receptor
Type:
Enzyme Catalytic Domain
Mol. Mass.:
44955.08
Organism:
GUINEA PIG
Description:
ADENOSINE A2 0 GUINEA PIG::P46616
Residue:
409
  
Inhibitor
Name:
BDBM82010
Synonyms:
1,3-Dipropyl-8-(4-hydroxyphenyl)xanthine CHEMBL27155
Type:
Emp. Form.:
C17H20N4O3
Mol. Mass.:
328.3657
SMILES:
CCCn1c2nc([nH]c2c(=O)n(CCC)c1=O)-c1ccc(O)cc1
: