Target
Adenosine receptor A2a
Ligand
BDBM82013
Substrate
Meas. Tech.
ChEBML_27639
Ki
1000±n/a nM
Citation
 Daly, JWPadgett, WShamim, MTButts-Lamb, PWaters, J 1,3-Dialkyl-8-(p-sulfophenyl)xanthines: potent water-soluble antagonists for A1- and A2-adenosine receptors. J Med Chem 28:487-92 (1985)  
Target
Name:
Adenosine receptor A2a
Synonyms:
AA2AR_CAVPO ADORA2A | Adenosine A2a receptor
Type:
Enzyme Catalytic Domain
Mol. Mass.:
44955.08
Organism:
GUINEA PIG
Description:
ADENOSINE A2 0 GUINEA PIG::P46616
Residue:
409
  
Inhibitor
Name:
BDBM82013
Synonyms:
8-(2-Amino-4-chloro-phenyl)-1,3-dipropyl-3,7-dihydro-purine-2,6-dione(PACPX) CAS_92411 NSC_92411 | PACPX
Type:
Small organic molecule
Emp. Form.:
C17H20ClN5O2
Mol. Mass.:
361.826
SMILES:
CCCn1c2nc([nH]c2c(=O)n(CCC)c1=O)-c1ccc(Cl)cc1N
: