Target
Adenosine receptor A1
Ligand
BDBM50020967
Substrate
Meas. Tech.
ChEMBL_28965 (CHEMBL640605)
IC50
1.6±n/a nM
Citation
 Hamilton, HWOrtwine, DFWorth, DFBadger, EWBristol, JABruns, RFHaleen, SJSteffen, RP Synthesis of xanthines as adenosine antagonists, a practical quantitative structure-activity relationship application. J Med Chem 28:1071-9 (1985)  
Target
Name:
Adenosine receptor A1
Synonyms:
AA1R_BOVIN ADENOSINE A1 high ADORA1 | Adenosine A1 receptor
Type:
Enzyme Catalytic Domain
Mol. Mass.:
36602.99
Organism:
BOVINE
Description:
ADENOSINE 0 BOVINE::P28190
Residue:
326
  
Inhibitor
Name:
BDBM50020967
Synonyms:
4-(1,3-Diethyl-2,6-dioxo-2,3,6,7-tetrahydro-1H-purin-8-yl)-N-(3-dimethylamino-propyl)-benzenesulfonamide | CHEMBL10913
Type:
Small organic molecule
Emp. Form.:
C20H28N6O4S
Mol. Mass.:
448.539
SMILES:
CCn1c2nc([nH]c2c(=O)n(CC)c1=O)-c1ccc(cc1)S(=O)(=O)NCCCN(C)C
: