Target
Adenosine receptor A1
Ligand
BDBM82025
Substrate
Meas. Tech.
ChEMBL_28965 (CHEMBL640605)
IC50
0.70±n/a nM
Citation
 Hamilton, HWOrtwine, DFWorth, DFBadger, EWBristol, JABruns, RFHaleen, SJSteffen, RP Synthesis of xanthines as adenosine antagonists, a practical quantitative structure-activity relationship application. J Med Chem 28:1071-9 (1985)  
Target
Name:
Adenosine receptor A1
Synonyms:
AA1R_BOVIN ADENOSINE A1 high ADORA1 | Adenosine A1 receptor
Type:
Enzyme Catalytic Domain
Mol. Mass.:
36602.99
Organism:
BOVINE
Description:
ADENOSINE 0 BOVINE::P28190
Residue:
326
  
Inhibitor
Name:
BDBM82025
Synonyms:
1,3-Dipropyl-8-phenylxanthine CAS_128784 NSC_128784
Type:
Small organic molecule
Emp. Form.:
C17H20N4O2
Mol. Mass.:
312.3663
SMILES:
CCCn1c2nc([nH]c2c(=O)n(CCC)c1=O)-c1ccccc1
: