Target
Angiotensin-converting enzyme 2
Ligand
BDBM50021031
Substrate
Meas. Tech.
ChEBML_35979
Ki
6400±n/a nM
Citation
 Elliott, RLMarks, NBerg, MJPortoghese, PS Synthesis and biological evaluation of phosphonamidate peptide inhibitors of enkephalinase and angiotensin-converting enzyme. J Med Chem 28:1208-16 (1985)  
Target
Name:
Angiotensin-converting enzyme 2
Synonyms:
ACE2_RAT Angiotensin-converting enzyme-related carboxypeptidase
Type:
PROTEIN
Mol. Mass.:
92475.04
Organism:
Rattus norvegicus
Description:
ChEMBL_35979
Residue:
805
  
Inhibitor
Name:
BDBM50021031
Synonyms:
CHEMBL19352 | N-[[[(Tyrosylglycyl)amino]methyl]hydroxyphosphinyl]phenylalanylleucine, disodium salt
Type:
Small organic molecule
Emp. Form.:
C26H37N5O7P
Mol. Mass.:
562.5756
SMILES:
CC(C)CC(NC(Cc1ccccc1)NP([O-])(=O)CNC(=O)CNC(=O)C(N)Cc1ccc(O)cc1)C(O)=O
: