Target
D(2) dopamine receptor
Ligand
BDBM50026557
Substrate
Meas. Tech.
ChEBML_61442
IC50
123±n/a nM
Citation
 de Paulis, TKumar, YJohansson, LRämsby, SFlorvall, LHall, HAngeby-Möller, KOgren, SO Potential neuroleptic agents. 3. Chemistry and antidopaminergic properties of substituted 6-methoxysalicylamides. J Med Chem 28:1263-9 (1985)  
Target
Name:
D(2) dopamine receptor
Synonyms:
DOPAMINE D2 DOPAMINE D2 Short Dopamine D2 receptor Drd2
Type:
G Protein-Coupled Receptor (GPCR)
Mol. Mass.:
50931.60
Organism:
Rattus norvegicus (rat)
Description:
P61169
Residue:
444
  
Inhibitor
Name:
BDBM50026557
Synonyms:
3-Ethyl-N-(1-ethyl-pyrrolidin-2-ylmethyl)-6-hydroxy-2-methoxy-benzamide | CHEMBL431490
Type:
Small organic molecule
Emp. Form.:
C17H26N2O3
Mol. Mass.:
306.3999
SMILES:
CCN1CCC[C@H]1CNC(=O)c1c(O)ccc(CC)c1OC
: