Target
Angiotensin-converting enzyme
Ligand
BDBM50021047
Substrate
Meas. Tech.
ChEBML_36882
IC50
220±n/a nM
Citation
 Roark, WHTinney, FJCohen, DEssenburg, ADKaplan, HR Synthesis and biological activity of modified peptide inhibitors of angiotensin-converting enzyme. J Med Chem 28:1291-5 (1985)  
Target
Name:
Angiotensin-converting enzyme
Synonyms:
ACE Angiotensin converting enzyme (ACE) Angiotensin-converting enzyme, soluble form CD_antigen=CD143 DCP1 Kininase II
Type:
Enzyme
Mol. Mass.:
149709.01
Organism:
Homo sapiens (Human)
Description:
Residue:
1306
  
Inhibitor
Name:
BDBM50021047
Synonyms:
(S,S)-1-[2-(1-Ethoxycarbonyl-3-phenyl-propoxy)-propionyl]-pyrrolidine-2-carboxylic acid | CHEMBL284494
Type:
Small organic molecule
Emp. Form.:
C20H27NO6
Mol. Mass.:
377.4315
SMILES:
CCOC(=O)C(CCc1ccccc1)OC(C)C(=O)N1CCCC1C(O)=O
: