Target
Angiotensin-converting enzyme
Ligand
BDBM50021049
Substrate
Meas. Tech.
ChEBML_36882
IC50
14±n/a nM
Citation
 Roark, WHTinney, FJCohen, DEssenburg, ADKaplan, HR Synthesis and biological activity of modified peptide inhibitors of angiotensin-converting enzyme. J Med Chem 28:1291-5 (1985)  
Target
Name:
Angiotensin-converting enzyme
Synonyms:
ACE Angiotensin converting enzyme (ACE) Angiotensin-converting enzyme, soluble form CD_antigen=CD143 DCP1 Kininase II
Type:
Enzyme
Mol. Mass.:
149709.01
Organism:
Homo sapiens (Human)
Description:
Residue:
1306
  
Inhibitor
Name:
BDBM50021049
Synonyms:
(S,S)-2-[2-(1-Ethoxycarbonyl-3-phenyl-propoxy)-propionyl]-1,2,3,4-tetrahydro-isoquinoline-3-carboxylic acid | CHEMBL25782
Type:
Small organic molecule
Emp. Form.:
C25H29NO6
Mol. Mass.:
439.5009
SMILES:
CCOC(=O)C(CCc1ccccc1)OC(C)C(=O)N1Cc2ccccc2CC1C(O)=O
: