Target
Angiotensin-converting enzyme
Ligand
BDBM50368166
Substrate
Meas. Tech.
ChEBML_36890
IC50
8.3±n/a nM
Citation
 Klutchko, SBlankley, CJFleming, RWHinkley, JMWerner, AENordin, IHolmes, AHoefle, MLCohen, DMEssenburg, AD Synthesis of novel angiotensin converting enzyme inhibitor quinapril and related compounds. A divergence of structure-activity relationships for non-sulfhydryl and sulfhydryl types. J Med Chem 29:1953-61 (1986)  
Target
Name:
Angiotensin-converting enzyme
Synonyms:
ACE Angiotensin converting enzyme (ACE) Angiotensin-converting enzyme, soluble form CD_antigen=CD143 DCP1 Kininase II
Type:
Enzyme
Mol. Mass.:
149709.01
Organism:
Homo sapiens (Human)
Description:
Residue:
1306
  
Inhibitor
Name:
BDBM50368166
Synonyms:
Accupril | QUINAPRIL
Type:
Small organic molecule
Emp. Form.:
C25H30N2O5
Mol. Mass.:
438.5161
SMILES:
CCOC(=O)[C@H](CCc1ccccc1)N[C@@H](C)C(=O)N1Cc2ccccc2C[C@H]1C(O)=O
: