Target
Angiotensin-converting enzyme
Ligand
BDBM50021525
Substrate
Meas. Tech.
ChEBML_36890
IC50
5.80±n/a nM
Citation
 Klutchko, SBlankley, CJFleming, RWHinkley, JMWerner, AENordin, IHolmes, AHoefle, MLCohen, DMEssenburg, AD Synthesis of novel angiotensin converting enzyme inhibitor quinapril and related compounds. A divergence of structure-activity relationships for non-sulfhydryl and sulfhydryl types. J Med Chem 29:1953-61 (1986)  
Target
Name:
Angiotensin-converting enzyme
Synonyms:
ACE Angiotensin converting enzyme (ACE) Angiotensin-converting enzyme, soluble form CD_antigen=CD143 DCP1 Kininase II
Type:
Enzyme
Mol. Mass.:
149709.01
Organism:
Homo sapiens (Human)
Description:
Residue:
1306
  
Inhibitor
Name:
BDBM50021525
Synonyms:
(S,S,S) 2-[2-(1-Carboxy-3-phenyl-propylamino)-propionyl]-1,2,3,4-tetrahydro-isoquinoline-1-carboxylic acid | CHEMBL61811
Type:
Small organic molecule
Emp. Form.:
C23H26N2O5
Mol. Mass.:
410.4629
SMILES:
CC(NC(CCc1ccccc1)C(O)=O)C(=O)N1CCc2ccccc2C1C(O)=O
: