Target
Angiotensin-converting enzyme
Ligand
BDBM50021274
Substrate
Meas. Tech.
ChEBML_35994
IC50
1700000±n/a nM
Citation
 Thorsett, EDHarris, EEAster, SDPeterson, ERSnyder, JPSpringer, JPHirshfield, JTristram, EWPatchett, AAUlm, EH Conformationally restricted inhibitors of angiotensin converting enzyme: synthesis and computations. J Med Chem 29:251-60 (1986)  
Target
Name:
Angiotensin-converting enzyme
Synonyms:
ACE Angiotensin converting enzyme (ACE) Angiotensin-converting enzyme, soluble form CD_antigen=CD143 DCP1 Kininase II
Type:
Enzyme
Mol. Mass.:
149709.01
Organism:
Homo sapiens (Human)
Description:
Residue:
1306
  
Inhibitor
Name:
BDBM50021274
Synonyms:
(3-Amino-2-oxo-piperidin-1-yl)-acetic acid | CHEMBL314707
Type:
Small organic molecule
Emp. Form.:
C7H12N2O3
Mol. Mass.:
172.1818
SMILES:
NC1CCCN(CC(O)=O)C1=O
: