Target
S-adenosylmethionine synthase isoform type-1/type-2
Ligand
BDBM50026193
Substrate
Meas. Tech.
ChEMBL_104809 (CHEMBL709694)
Ki
180000±n/a nM
Citation
 Kappler, FHai, TTHampton, A Isozyme-specific enzyme inhibitors. 10. Adenosine 5'-triphosphate derivatives as substrates or inhibitors of methionine adenosyltransferases of rat normal and hepatoma tissues. J Med Chem 29:318-22 (1986)  
Target
Name:
S-adenosylmethionine synthase isoform type-1/type-2
Synonyms:
S-adenosylmethionine synthetase (MAT 1 and MAT 2)
Type:
Mol. Mass.:
Description:
ASSAY_ID of ChEMBL is 104961
Components:
This complex has 2 components.
Component 1
Name:
S-adenosylmethionine synthase isoform type-1
Synonyms:
AdoMet synthetase 1 MAT 1 METK1_RAT Methionine adenosyltransferase 1 S-adenosylmethionine synthetase (MAT 1 and MAT 2) S-adenosylmethionine synthetase isoform type-1
Type:
PROTEIN
Mol. Mass.:
43692.87
Organism:
Rattus norvegicus
Description:
ChEMBL_11027
Residue:
397
  
Component 2
Name:
S-adenosylmethionine synthase isoform type-2
Synonyms:
AdoMet synthetase 2 MAT 2 METK2_RAT Methionine adenosyltransferase 2 S-Adenosylmethionine Synthase (AdoMet) S-adenosylmethionine synthetase gamma form | S-adenosylmethionine synthetase isoform type-2
Type:
PROTEIN
Mol. Mass.:
43713.68
Organism:
Rattus norvegicus
Description:
ChEMBL_105118
Residue:
395
  
Inhibitor
Name:
BDBM50026193
Synonyms:
Adenosine 5'-triphosphate derivative | CHEMBL3142845
Type:
Small organic molecule
Emp. Form.:
C11H18N5O13P3
Mol. Mass.:
521.2076
SMILES:
CO[C@@H]1[C@@H](COP(O)(=O)OP(O)(=O)OP(O)(O)=O)O[C@H]([C@@H]1O)n1cnc2c(N)ncnc12
: