Target
Dihydrofolate reductase
Ligand
BDBM50016323
Substrate
Meas. Tech.
ChEBML_54595
Ki
0.00212±0.0004 nM
Citation
 Piper, JRMcCaleb, GSMontgomery, JAKisliuk, RLGaumont, YSirotnak, FM Syntheses and antifolate activity of 5-methyl-5-deaza analogues of aminopterin, methotrexate, folic acid, and N10-methylfolic acid. J Med Chem 29:1080-7 (1986)  
Target
Name:
Dihydrofolate reductase
Synonyms:
DYR_MOUSE | Dhfr
Type:
Enzyme
Mol. Mass.:
21608.82
Organism:
Mus musculus (Mouse)
Description:
Residue:
187
  
Inhibitor
Name:
BDBM50016323
Synonyms:
2-{4-[(2,4-Diamino-5-methyl-pyrido[2,3-d]pyrimidin-6-ylmethyl)-methyl-amino]-benzoylamino}-pentanedioic acid | CHEMBL12094
Type:
Small organic molecule
Emp. Form.:
C22H25N7O5
Mol. Mass.:
467.4778
SMILES:
CN(Cc1cnc2nc(N)nc(N)c2c1C)c1ccc(cc1)C(=O)NC(CCC(O)=O)C(O)=O
: