Target
Renin
Ligand
BDBM50022516
Substrate
Meas. Tech.
ChEMBL_154897 (CHEMBL764016)
IC50
170±n/a nM
Citation
 Guégan, RDiaz, JCazaubon, CBeaumont, MCarlet, CClément, JDemarne, HMellet, MRichaud, JPSegondy, D Pepstatin analogues as novel renin inhibitors. J Med Chem 29:1152-9 (1987)  
Target
Name:
Renin
Synonyms:
Angiotensinogenase RENI_HUMAN
Type:
Enzyme
Mol. Mass.:
45058.99
Organism:
Homo sapiens (Human)
Description:
Residue:
406
  
Inhibitor
Name:
BDBM50022516
Synonyms:
Boc-Trp-Trp-Sta-Ala-Sta-OMe | CHEMBL3142766
Type:
Small organic molecule
Emp. Form.:
C47H67N7O10
Mol. Mass.:
890.0758
SMILES:
COC(=O)C[C@H](O)[C@H](CC(C)C)NC(=O)[C@H](C)NC(=O)C[C@H](O)[C@H](CC(C)C)NC(=O)[C@H](Cc1c[nH]c2ccccc12)NC(=O)[C@H](Cc1c[nH]c2ccccc12)NC(=O)OC(C)(C)C
: