Target
Renin
Ligand
BDBM50024174
Substrate
Meas. Tech.
ChEMBL_154893 (CHEMBL764012)
IC50
52±n/a nM
Citation
 Guégan, RDiaz, JCazaubon, CBeaumont, MCarlet, CClément, JDemarne, HMellet, MRichaud, JPSegondy, D Pepstatin analogues as novel renin inhibitors. J Med Chem 29:1152-9 (1987)  
Target
Name:
Renin
Synonyms:
RENI_RAT Ren1
Type:
PROTEIN
Mol. Mass.:
44272.67
Organism:
Rattus norvegicus
Description:
ChEMBL_222765
Residue:
402
  
Inhibitor
Name:
BDBM50024174
Synonyms:
4-(2-{4-[2-(2-tert-Butoxycarbonylamino-3-phenyl-propionylamino)-3-phenyl-propionylamino]-3-hydroxy-6-methyl-heptanoylamino}-propionylamino)-3-hydroxy-6-methyl-heptanoic acid methyl ester | CHEMBL3142787
Type:
Small organic molecule
Emp. Form.:
C43H65N5O10
Mol. Mass.:
812.0037
SMILES:
COC(=O)C[C@H](O)[C@H](CC(C)C)NC(=O)[C@H](C)NC(=O)C[C@H](O)[C@H](CC(C)C)NC(=O)[C@H](Cc1ccccc1)NC(=O)[C@H](Cc1ccccc1)NC(=O)OC(C)(C)C
: