Target
Mu-type opioid receptor
Ligand
BDBM50001707
Substrate
Meas. Tech.
ChEBML_145291
Ki
15±n/a nM
Citation
 Lipkowski, AWTam, SWPortoghese, PS Peptides as receptor selectivity modulators of opiate pharmacophores. J Med Chem 29:1222-5 (1987)  
Target
Name:
Mu-type opioid receptor
Synonyms:
M-OR-1 Mu opioid receptor OPIATE Mu OPRM_CAVPO
Type:
Enzyme Catalytic Domain
Mol. Mass.:
11165.58
Organism:
GUINEA PIG
Description:
P97266
Residue:
98
  
Inhibitor
Name:
BDBM50001707
Synonyms:
10,17-dihydroxy-4-methyl-(13R,17S)-12-oxa-4-azapentacyclo[9.6.1.01,13.05,17.07,18]octadeca-7(18),8,10-trien-14-one 10,17-dihydroxy-4-methyl-(13R,17S)-12-oxa-4-azapentacyclo[9.6.1.01,13.05,17.07,18]octadeca-7(18),8,10-trien-14-one(xymorphone) CHEMBL963 Combunox OXYMORPHONE Oxycet Percocet Roxicet Roxiprin Tylox-325
Type:
Small organic molecule
Emp. Form.:
C17H19NO4
Mol. Mass.:
301.3371
SMILES:
CN1CC[C@@]23[C@H]4Oc5c2c(C[C@@H]1[C@]3(O)CCC4=O)ccc5O
: