Target
D(2) dopamine receptor
Ligand
BDBM50005132
Substrate
Meas. Tech.
ChEBML_58559
IC50
>1000±n/a nM
Citation
 New, JSYevich, JPEison, MSTaylor, DPEison, ASRiblet, LAVanderMaelen, CPTemple, DL Buspirone analogues. 2. Structure-activity relationships of aromatic imide derivatives. J Med Chem 29:1476-82 (1986)  
Target
Name:
D(2) dopamine receptor
Synonyms:
DOPAMINE D2 DOPAMINE D2 Short Dopamine D2 receptor Drd2
Type:
G Protein-Coupled Receptor (GPCR)
Mol. Mass.:
50931.60
Organism:
Rattus norvegicus (rat)
Description:
P61169
Residue:
444
  
Inhibitor
Name:
BDBM50005132
Synonyms:
4,4-Dimethyl-1-[4-(4-pyrimidin-2-yl-piperazin-1-yl)-butyl]-piperidine-2,6-dione CHEMBL1204187 GEPIRONE | gepiron ER
Type:
Small organic molecule
Emp. Form.:
C19H29N5O2
Mol. Mass.:
359.4659
SMILES:
CC1(C)CC(=O)N(CCCCN2CCN(CC2)c2ncccn2)C(=O)C1
: