Target
Thymidylate synthase
Ligand
BDBM50022234
Substrate
Meas. Tech.
ChEBML_209114
IC50
5.5±n/a nM
Citation
 Nair, MGNanavati, NTNair, IGKisliuk, RLGaumont, YHsiao, MCKalman, TI Folate analogues. 26. Syntheses and antifolate activity of 10-substituted derivatives of 5,8-dideazafolic acid and of the poly-gamma-glutamyl metabolites of N10-propargyl-5,8-dideazafolic acid (PDDF). J Med Chem 29:1754-60 (1986)  
Target
Name:
Thymidylate synthase
Synonyms:
TS TYMS Thymidylate synthase (TS) | Thymidylate synthase/GAR transformylase/AICAR transformylase
Type:
Enzyme
Mol. Mass.:
35718.07
Organism:
Homo sapiens (Human)
Description:
Residue:
313
  
Inhibitor
Name:
BDBM50022234
Synonyms:
4-[4-(4-{4-[(2-Amino-4-hydroxy-quinazolin-6-ylmethyl)-ethynyl-amino]-benzoylamino}-4-carboxy-butyrylamino)-4-carboxy-butyrylamino]-4-carboxy-butyric acid anion
Type:
Small organic molecule
Emp. Form.:
C33H34N7O12
Mol. Mass.:
720.6633
SMILES:
Nc1nc2ccc(CN(C#C)c3ccc(cc3)C(=O)NC(CCC(=O)NC(CCC(=O)NC(CCC([O-])=O)C(O)=O)C(O)=O)C(O)=O)cc2c(=O)[nH]1
: