Target
Thymidylate synthase
Ligand
BDBM50022236
Substrate
Meas. Tech.
ChEBML_209113
IC50
4400±n/a nM
Citation
 Nair, MGNanavati, NTNair, IGKisliuk, RLGaumont, YHsiao, MCKalman, TI Folate analogues. 26. Syntheses and antifolate activity of 10-substituted derivatives of 5,8-dideazafolic acid and of the poly-gamma-glutamyl metabolites of N10-propargyl-5,8-dideazafolic acid (PDDF). J Med Chem 29:1754-60 (1986)  
Target
Name:
Thymidylate synthase
Synonyms:
TSase Thymidylate Synthase (TS) thyA
Type:
Enzyme
Mol. Mass.:
36576.54
Organism:
Lactobacillus casei
Description:
Residue:
316
  
Inhibitor
Name:
BDBM50022236
Synonyms:
(S)-2-{4-[(2-Amino-4-oxo-3,4-dihydro-quinazolin-6-ylmethyl)-but-2-ynyl-amino]-benzoylamino}-pentanedioic acid | CHEMBL48619
Type:
Small organic molecule
Emp. Form.:
C25H25N5O6
Mol. Mass.:
491.4959
SMILES:
CC#CCN(Cc1ccc2nc(N)[nH]c(=O)c2c1)c1ccc(cc1)C(=O)N[C@@H](CCC(O)=O)C(O)=O
: