Target
Dihydrofolate reductase
Ligand
BDBM50022232
Substrate
Meas. Tech.
ChEBML_54904
IC50
4900±n/a nM
Citation
 Nair, MGNanavati, NTNair, IGKisliuk, RLGaumont, YHsiao, MCKalman, TI Folate analogues. 26. Syntheses and antifolate activity of 10-substituted derivatives of 5,8-dideazafolic acid and of the poly-gamma-glutamyl metabolites of N10-propargyl-5,8-dideazafolic acid (PDDF). J Med Chem 29:1754-60 (1986)  
Target
Name:
Dihydrofolate reductase
Synonyms:
DYR_LACCA folA
Type:
PROTEIN
Mol. Mass.:
18437.08
Organism:
Lactobacillus casei
Description:
ChEMBL_1357878
Residue:
163
  
Inhibitor
Name:
BDBM50022232
Synonyms:
2-{4-[(2-Amino-4-hydroxy-quinazolin-6-ylmethyl)-ethynyl-amino]-benzoylamino}-5-oxo-pentanoic acid anion
Type:
Small organic molecule
Emp. Form.:
C23H20N5O5
Mol. Mass.:
446.4359
SMILES:
Nc1nc2ccc(CN(C#C)c3ccc(cc3)C(=O)NC(CCC=O)C([O-])=O)cc2c(=O)[nH]1
: