Target
Dihydrofolate reductase
Ligand
BDBM50022235
Substrate
Meas. Tech.
ChEBML_53306
IC50
290±n/a nM
Citation
 Nair, MGNanavati, NTNair, IGKisliuk, RLGaumont, YHsiao, MCKalman, TI Folate analogues. 26. Syntheses and antifolate activity of 10-substituted derivatives of 5,8-dideazafolic acid and of the poly-gamma-glutamyl metabolites of N10-propargyl-5,8-dideazafolic acid (PDDF). J Med Chem 29:1754-60 (1986)  
Target
Name:
Dihydrofolate reductase
Synonyms:
DHFR Dihydrofolate reductase (DHFR) | Tetrahydrofolate dehydrogenase
Type:
Enzyme
Mol. Mass.:
21453.99
Organism:
Homo sapiens (Human)
Description:
Recombinant human DHFR.
Residue:
187
  
Inhibitor
Name:
BDBM50022235
Synonyms:
4-(4-{4-[4-(2-{4-[(2-Amino-4-hydroxy-quinazolin-6-ylmethyl)-ethynyl-amino]-benzoylamino}-4-carboxy-butyrylamino)-4-carboxy-butyrylamino]-4-carboxy-butyrylamino}-4-carboxy-butyrylamino)-4-carboxy-butyric acid anion PDDP-G5
Type:
Small organic molecule
Emp. Form.:
C43H48N9O18
Mol. Mass.:
978.8913
SMILES:
Nc1nc2ccc(CN(C#C)c3ccc(cc3)C(=O)NC(CCC(O)=O)C(=O)NC(CCC(=O)NC(CCC(=O)NC(CCC(=O)NC(CCC([O-])=O)C(O)=O)C(O)=O)C(O)=O)C(O)=O)cc2c(=O)[nH]1
: