Target
5-hydroxytryptamine receptor 1B
Ligand
BDBM30707
Substrate
Meas. Tech.
ChEBML_1800
Ki
90±n/a nM
Citation
 Glennon, RA Central serotonin receptors as targets for drug research. J Med Chem 30:1-12 (1987)  
Target
Name:
5-hydroxytryptamine receptor 1B
Synonyms:
5-HT-1B 5-hydroxytryptamine receptor 1B (5HT1B) 5ht1b Serotonin 1 (5-HT1) receptor Serotonin receptor 1B
Type:
Protein
Mol. Mass.:
43173.33
Organism:
Rattus norvegicus (Rat)
Description:
P28564
Residue:
386
  
Inhibitor
Name:
BDBM30707
Synonyms:
2-(5-methoxy-1H-indol-3-yl)-N,N-dimethyl-ethanamine 2-(5-methoxy-1H-indol-3-yl)ethyl-dimethyl-amine CHEMBL7257 Methoxydimethyltryptamines WO2023019367, Compound 5-MeO-DMT | cid_1832
Type:
Small organic molecule
Emp. Form.:
C13H18N2O
Mol. Mass.:
218.2948
SMILES:
COc1ccc2[nH]cc(CCN(C)C)c2c1
: