Target
5-hydroxytryptamine receptor 2C
Ligand
BDBM50016900
Substrate
Meas. Tech.
ChEBML_1848
Ki
200±n/a nM
Citation
 Glennon, RA Central serotonin receptors as targets for drug research. J Med Chem 30:1-12 (1987)  
Target
Name:
5-hydroxytryptamine receptor 2C
Synonyms:
5-HT-2C 5-HT2C-INI 5-HTR2C 5-hydroxytryptamine receptor 2C (5-HT-2C) 5HT-1C HTR1C Serotonin (5-HT3) receptor Serotonin Receptor 2C
Type:
G Protein-Coupled Receptor (GPCR)
Mol. Mass.:
51836.79
Organism:
Homo sapiens (Human)
Description:
P28335
Residue:
458
  
Inhibitor
Name:
BDBM50016900
Synonyms:
(E)-N-[2-(3-Dimethylamino-propylsulfanyl)-phenyl]-3-phenyl-acrylamide CINANSERIN N-[2-(3-Dimethylamino-propylsulfanyl)-phenyl]-3-phenyl-acrylamide N-[2-(3-Dimethylamino-propylsulfanyl)-phenyl]-3-phenyl-acrylamide(Cinanserin) | acs.jmedchem.1c00409_ST.370
Type:
Small organic molecule
Emp. Form.:
C20H24N2OS
Mol. Mass.:
340.482
SMILES:
CN(C)CCCSc1ccccc1NC(=O)\C=C\c1ccccc1
: