Target
D(2) dopamine receptor
Ligand
BDBM50018647
Substrate
Meas. Tech.
ChEBML_61412
IC50
7500±n/a nM
Citation
 Wikström, HAndersson, BElebring, TSvensson, KCarlsson, ALargent, B N-substituted 1,2,3,4,4a,5,6,10b-octahydrobenzo[f]quinolines and 3-phenylpiperidines: effects on central dopamine and sigma receptors. J Med Chem 30:2169-74 (1988)  
Target
Name:
D(2) dopamine receptor
Synonyms:
DOPAMINE D2 DOPAMINE D2 Short Dopamine D2 receptor Drd2
Type:
G Protein-Coupled Receptor (GPCR)
Mol. Mass.:
50931.60
Organism:
Rattus norvegicus (rat)
Description:
P61169
Residue:
444
  
Inhibitor
Name:
BDBM50018647
Synonyms:
(R,R)-1,2,3,4,4a,5,6,10b-Octahydro-benzo[f]quinolin-7-ol CHEMBL302244 | rac-1,2,3,4,4a,5,6,10b-Octahydro-benzo[f]quinolin-7-ol
Type:
Small organic molecule
Emp. Form.:
C13H17NO
Mol. Mass.:
203.2802
SMILES:
Oc1cccc2C3CCCNC3CCc12
: