Target
Voltage-dependent L-type calcium channel subunit alpha-1C
Ligand
BDBM50452436
Substrate
Meas. Tech.
ChEBML_53174
Ki
6000±n/a nM
Citation
 Baldwin, JJClaremon, DALumma, PKMcClure, DERosenthal, SAWinquist, RJFaison, EPKaczorowski, GJTrumble, MJSmith, GM Diethyl 3,6-dihydro-2,4-dimethyl-2,6-methano-1,3-benzothiazocine-5,11- dicarboxylates as calcium entry antagonists: new conformationally restrained analogues of Hantzsch 1,4-dihydropyridines related to nitrendipine as probes for receptor-site conformation. J Med Chem 30:690-5 (1987)  
Target
Name:
Voltage-dependent L-type calcium channel subunit alpha-1C
Synonyms:
CAC1C_HUMAN CACN2 CACNL1A1 Calcium channel (Type L) L-type calcium channel alpha-1c/beta-2/alpha2delta-1 Voltage-gated L-type calcium channel Voltage-gated calcium channel | Voltage-gated calcium channel subunit alpha Cav1.2
Type:
Enzyme Catalytic Domain
Mol. Mass.:
248979.79
Organism:
Homo sapiens (Human)
Description:
Calcium channel (Type L) 0 HUMAN::Q13936
Residue:
2221
  
Inhibitor
Name:
BDBM50452436
Synonyms:
CHEMBL2110301
Type:
Small organic molecule
Emp. Form.:
C19H22N2O6S
Mol. Mass.:
406.453
SMILES:
[H][C@@]12[C@@H](C(=O)OCC)[C@@](C)(Sc3c(cccc13)[N+]([O-])=O)N=C(C)\C2=C(\O)OCC
: