Target
Thymidine kinase, cytosolic
Ligand
BDBM50367487
Substrate
Meas. Tech.
ChEMBL_207848 (CHEMBL810057)
Ki
1400±n/a nM
Citation
 Mansuri, MMGhazzouli, IChen, MSHowell, HGBrodfuehrer, PRBenigni, DAMartin, JC 1-(2-Deoxy-2-fluoro-beta-D-arabinofuranosyl)-5-ethyluracil. A highly selective antiherpes simplex agent. J Med Chem 30:867-71 (1987)  
Target
Name:
Thymidine kinase, cytosolic
Synonyms:
KITH_HUMAN | TK1
Type:
PROTEIN
Mol. Mass.:
25476.50
Organism:
Homo sapiens (Human)
Description:
ChEMBL_1333884
Residue:
234
  
Inhibitor
Name:
BDBM50367487
Synonyms:
CHEMBL475717
Type:
Small organic molecule
Emp. Form.:
C10H13FN2O5
Mol. Mass.:
260.219
SMILES:
Cc1cn([C@@H]2O[C@H](CO)[C@@H](O)[C@@H]2F)c(=O)[nH]c1=O
: