Target
Adenosine receptor A1
Ligand
BDBM42467
Substrate
Meas. Tech.
ChEBML_28964
IC50
4.6±n/a nM
Citation
 Kwatra, MMLeung, EHosey, MMGreen, RD N6-phenyladenosines: pronounced effect of phenyl substituents on affinity for A2 adenosine receptors. J Med Chem 30:954-6 (1987)  
Target
Name:
Adenosine receptor A1
Synonyms:
AA1R_CHICK ADORA1 | Adenosine A1 receptor
Type:
Enzyme Catalytic Domain
Mol. Mass.:
36337.19
Organism:
Chick
Description:
ADENOSINE A1 ADORA1 Chick::P49892
Residue:
324
  
Inhibitor
Name:
BDBM42467
Synonyms:
(2R,3R,4S,5R)-2-(6-anilino-9-purinyl)-5-(hydroxymethyl)oxolane-3,4-diol (2R,3R,4S,5R)-2-(6-anilinopurin-9-yl)-5-methylol-tetrahydrofuran-3,4-diol MLS000069355 N6-PHENYLADENOSINE cid_101430
Type:
Small organic molecule
Emp. Form.:
C16H17N5O4
Mol. Mass.:
343.3373
SMILES:
OC[C@H]1O[C@H]([C@H](O)[C@@H]1O)n1cnc2c(Nc3ccccc3)ncnc12
: