Target
Adenosine receptor A1
Ligand
BDBM50367499
Substrate
Meas. Tech.
ChEBML_28964
IC50
45±n/a nM
Citation
 Kwatra, MMLeung, EHosey, MMGreen, RD N6-phenyladenosines: pronounced effect of phenyl substituents on affinity for A2 adenosine receptors. J Med Chem 30:954-6 (1987)  
Target
Name:
Adenosine receptor A1
Synonyms:
AA1R_CHICK ADORA1 | Adenosine A1 receptor
Type:
Enzyme Catalytic Domain
Mol. Mass.:
36337.19
Organism:
Chick
Description:
ADENOSINE A1 ADORA1 Chick::P49892
Residue:
324
  
Inhibitor
Name:
BDBM50367499
Synonyms:
CHEMBL609086
Type:
Small organic molecule
Emp. Form.:
C16H18N6O4
Mol. Mass.:
358.3519
SMILES:
Nc1cccc(Nc2ncnc3n(cnc23)C2O[C@H](CO)[C@@H](O)[C@H]2O)c1
: