Target
Angiotensin-converting enzyme
Ligand
BDBM50027141
Substrate
Meas. Tech.
ChEBML_35219
IC50
3.2±n/a nM
Citation
 Blankley, CJKaltenbronn, JSDeJohn, DEWerner, ABennett, LRBobowski, GKrolls, UJohnson, DRPearlman, WMHoefle, ML Synthesis and structure-activity relationships of potent new angiotensin converting enzyme inhibitors containing saturated bicyclic amino acids. J Med Chem 30:992-8 (1987)  
Target
Name:
Angiotensin-converting enzyme
Synonyms:
ACE_RAT Angiotensin-converting enzyme | Dcp1
Type:
PROTEIN
Mol. Mass.:
150907.81
Organism:
Rattus norvegicus
Description:
ChEMBL_35219
Residue:
1313
  
Inhibitor
Name:
BDBM50027141
Synonyms:
1-(5-Benzoylamino-4-oxo-6-phenyl-hexanoyl)-pyrrolidine-2-carboxylic acid | CHEMBL416147
Type:
Small organic molecule
Emp. Form.:
C24H26N2O5
Mol. Mass.:
422.4736
SMILES:
OC(=O)[C@@H]1CCCN1C(=O)CCC(=O)C(Cc1ccccc1)NC(=O)c1ccccc1
: