Target
Aromatase
Ligand
BDBM50024488
Substrate
Meas. Tech.
ChEBML_51214
EC50
530±n/a nM
Citation
 Taylor, HMJones, CDDavenport, JDHirsch, KSKress, TJWeaver, D Aromatase inhibition by 5-substituted pyrimidines and dihydropyrimidines. J Med Chem 30:1359-65 (1987)  
Target
Name:
Aromatase
Synonyms:
Arom CP19A_RAT Cyp19 Cytochrome P450 19A1 P-450AROM
Type:
PROTEIN
Mol. Mass.:
58418.09
Organism:
Rattus norvegicus
Description:
ChEMBL_51211
Residue:
508
  
Inhibitor
Name:
BDBM50024488
Synonyms:
Bis-(4-fluoro-phenyl)-pyrimidin-5-yl-methanol | CHEMBL28696
Type:
Small organic molecule
Emp. Form.:
C17H12F2N2O
Mol. Mass.:
298.2868
SMILES:
OC(c1ccc(F)cc1)(c1ccc(F)cc1)c1cncnc1
: