Target
Aromatase
Ligand
BDBM50024512
Substrate
Meas. Tech.
ChEBML_51214
EC50
>2000±n/a nM
Citation
 Taylor, HMJones, CDDavenport, JDHirsch, KSKress, TJWeaver, D Aromatase inhibition by 5-substituted pyrimidines and dihydropyrimidines. J Med Chem 30:1359-65 (1987)  
Target
Name:
Aromatase
Synonyms:
Arom CP19A_RAT Cyp19 Cytochrome P450 19A1 P-450AROM
Type:
PROTEIN
Mol. Mass.:
58418.09
Organism:
Rattus norvegicus
Description:
ChEMBL_51211
Residue:
508
  
Inhibitor
Name:
BDBM50024512
Synonyms:
CHEMBL280781 | Cyclohexyl-pyrimidin-5-yl-p-tolyl-methanol
Type:
Small organic molecule
Emp. Form.:
C18H22N2O
Mol. Mass.:
282.3801
SMILES:
Cc1ccc(cc1)C(O)(C1CCCCC1)c1cncnc1
: