Target
Aromatase
Ligand
BDBM50024518
Substrate
Meas. Tech.
ChEBML_51214
EC50
4000±n/a nM
Citation
 Taylor, HMJones, CDDavenport, JDHirsch, KSKress, TJWeaver, D Aromatase inhibition by 5-substituted pyrimidines and dihydropyrimidines. J Med Chem 30:1359-65 (1987)  
Target
Name:
Aromatase
Synonyms:
Arom CP19A_RAT Cyp19 Cytochrome P450 19A1 P-450AROM
Type:
PROTEIN
Mol. Mass.:
58418.09
Organism:
Rattus norvegicus
Description:
ChEMBL_51211
Residue:
508
  
Inhibitor
Name:
BDBM50024518
Synonyms:
(4-Chloro-phenyl)-cyclohexyl-pyrimidin-5-yl-methanol | CHEMBL282079
Type:
Small organic molecule
Emp. Form.:
C17H19ClN2O
Mol. Mass.:
302.799
SMILES:
OC(C1CCCCC1)(c1ccc(Cl)cc1)c1cncnc1
: