Target
Aldo-keto reductase family 1 member B1 [K65Q]
Ligand
BDBM50022459
Substrate
Meas. Tech.
ChEMBL_31633 (CHEMBL649694)
IC50
1000±n/a nM
Citation
 Sarges, RSchnur, RCBelletire, JLPeterson, MJ Spiro hydantoin aldose reductase inhibitors. J Med Chem 31:230-43 (1988)  
Target
Name:
Aldo-keto reductase family 1 member B1 [K65Q]
Synonyms:
AKR1B1 Aldose reductase
Type:
Protein
Mol. Mass.:
35916.27
Organism:
Bos taurus (Cattle)
Description:
P16116[K65Q]
Residue:
315
  
Inhibitor
Name:
BDBM50022459
Synonyms:
6'-fluorospiro[tetrahydro-1H-imidazole-4,4'-(3',4'-dihydro-2'H-sulphochromene)]-2,5-dione | CHEMBL81027
Type:
Small organic molecule
Emp. Form.:
C11H9FN2O3S
Mol. Mass.:
268.264
SMILES:
Fc1ccc2c(c1)C1(CCS2=O)NC(=O)NC1=O
: