Target
Aldo-keto reductase family 1 member B1 [K65Q]
Ligand
BDBM50022436
Substrate
Meas. Tech.
ChEMBL_31633 (CHEMBL649694)
IC50
1000±n/a nM
Citation
 Sarges, RSchnur, RCBelletire, JLPeterson, MJ Spiro hydantoin aldose reductase inhibitors. J Med Chem 31:230-43 (1988)  
Target
Name:
Aldo-keto reductase family 1 member B1 [K65Q]
Synonyms:
AKR1B1 Aldose reductase
Type:
Protein
Mol. Mass.:
35916.27
Organism:
Bos taurus (Cattle)
Description:
P16116[K65Q]
Residue:
315
  
Inhibitor
Name:
BDBM50022436
Synonyms:
CHEMBL312392 | spiro[tetrahydro-1H-imidazole-4,1'-(2',3'-dihydro-1'H,5'H-pyrido[3,2,1-ij]quinoline)]-2,5,5'-trione
Type:
Small organic molecule
Emp. Form.:
C14H11N3O3
Mol. Mass.:
269.2554
SMILES:
O=C1NC(=O)C2(CCn3c4c2cccc4ccc3=O)N1
: