Target
Aldo-keto reductase family 1 member B1 [K65Q]
Ligand
BDBM50227014
Substrate
Meas. Tech.
ChEMBL_31628 (CHEMBL648023)
IC50
<100±n/a nM
Citation
 Sarges, RSchnur, RCBelletire, JLPeterson, MJ Spiro hydantoin aldose reductase inhibitors. J Med Chem 31:230-43 (1988)  
Target
Name:
Aldo-keto reductase family 1 member B1 [K65Q]
Synonyms:
AKR1B1 Aldose reductase
Type:
Protein
Mol. Mass.:
35916.27
Organism:
Bos taurus (Cattle)
Description:
P16116[K65Q]
Residue:
315
  
Inhibitor
Name:
BDBM50227014
Synonyms:
CHEMBL432927
Type:
Small organic molecule
Emp. Form.:
C14H10ClN3O3
Mol. Mass.:
303.701
SMILES:
Clc1cc2c3n(CCC22NC(=O)NC2=O)c(=O)ccc3c1
: