Target
Aldo-keto reductase family 1 member B1 [K65Q]
Ligand
BDBM50022416
Substrate
Meas. Tech.
ChEBML_31633
IC50
>100000±n/a nM
Citation
 Sarges, RSchnur, RCBelletire, JLPeterson, MJ Spiro hydantoin aldose reductase inhibitors. J Med Chem 31:230-43 (1988)  
Target
Name:
Aldo-keto reductase family 1 member B1 [K65Q]
Synonyms:
AKR1B1 Aldose reductase
Type:
Protein
Mol. Mass.:
35916.27
Organism:
Bos taurus (Cattle)
Description:
P16116[K65Q]
Residue:
315
  
Inhibitor
Name:
BDBM50022416
Synonyms:
CHEMBL78661 | octahydro-2H,2'H,5H-spiro[imidazolidine-4,1'-naphthalene]-2,5-dione
Type:
Small organic molecule
Emp. Form.:
C12H18N2O2
Mol. Mass.:
222.2835
SMILES:
O=C1NC(=O)C2(CCCC3CCCCC23)N1
: