Target
Aldo-keto reductase family 1 member B1 [K65Q]
Ligand
BDBM50022444
Substrate
Meas. Tech.
ChEBML_31633
IC50
10000±n/a nM
Citation
 Sarges, RSchnur, RCBelletire, JLPeterson, MJ Spiro hydantoin aldose reductase inhibitors. J Med Chem 31:230-43 (1988)  
Target
Name:
Aldo-keto reductase family 1 member B1 [K65Q]
Synonyms:
AKR1B1 Aldose reductase
Type:
Protein
Mol. Mass.:
35916.27
Organism:
Bos taurus (Cattle)
Description:
P16116[K65Q]
Residue:
315
  
Inhibitor
Name:
BDBM50022444
Synonyms:
2',3'-dihydro-2H,5H-spiro[imidazolidine-4,4'-thiochromene]-2,5-dione | CHEMBL82300
Type:
Small organic molecule
Emp. Form.:
C11H10N2O2S
Mol. Mass.:
234.274
SMILES:
O=C1NC(=O)C2(CCSc3ccccc23)N1
: