Target
Aldo-keto reductase family 1 member B1 [K65Q]
Ligand
BDBM50022469
Substrate
Meas. Tech.
ChEBML_31633
IC50
>100000±n/a nM
Citation
 Sarges, RSchnur, RCBelletire, JLPeterson, MJ Spiro hydantoin aldose reductase inhibitors. J Med Chem 31:230-43 (1988)  
Target
Name:
Aldo-keto reductase family 1 member B1 [K65Q]
Synonyms:
AKR1B1 Aldose reductase
Type:
Protein
Mol. Mass.:
35916.27
Organism:
Bos taurus (Cattle)
Description:
P16116[K65Q]
Residue:
315
  
Inhibitor
Name:
BDBM50022469
Synonyms:
CHEMBL79251 | spiro[2,3-dihydro-1H-indene-1,3'-(tetrahydro-1'H-pyrrole)]
Type:
Small organic molecule
Emp. Form.:
C12H15N
Mol. Mass.:
173.2542
SMILES:
C1CC2(CCc3ccccc23)CN1
: