Target
Aldo-keto reductase family 1 member B1 [K65Q]
Ligand
BDBM50022483
Substrate
Meas. Tech.
ChEBML_31633
IC50
100000±n/a nM
Citation
 Sarges, RSchnur, RCBelletire, JLPeterson, MJ Spiro hydantoin aldose reductase inhibitors. J Med Chem 31:230-43 (1988)  
Target
Name:
Aldo-keto reductase family 1 member B1 [K65Q]
Synonyms:
AKR1B1 Aldose reductase
Type:
Protein
Mol. Mass.:
35916.27
Organism:
Bos taurus (Cattle)
Description:
P16116[K65Q]
Residue:
315
  
Inhibitor
Name:
BDBM50022483
Synonyms:
7'-methoxyspiro[tetrahydro-1H-imidazole-4,1'-(1',2',3',4'-tetrahydronaphthalene)]-2,5-dione | CHEMBL309965
Type:
Small organic molecule
Emp. Form.:
C13H14N2O3
Mol. Mass.:
246.2619
SMILES:
COc1ccc2CCCC3(NC(=O)NC3=O)c2c1
: