Target
Beta-1 adrenergic receptor
Ligand
BDBM50019060
Substrate
Meas. Tech.
ChEBML_39181
Ki
350±n/a nM
Citation
 Adejare, AGusovsky, FPadgett, WCreveling, CRDaly, JWKirk, KL Syntheses and adrenergic activities of ring-fluorinated epinephrines. J Med Chem 31:1972-7 (1988)  
Target
Name:
Beta-1 adrenergic receptor
Synonyms:
ADRB1 adrenergic Beta1
Type:
Enzyme Catalytic Domain
Mol. Mass.:
50540.48
Organism:
GUINEA PIG
Description:
adrenergic Beta1 ADRB1 GUINEA PIG::B0FL73
Residue:
467
  
Inhibitor
Name:
BDBM50019060
Synonyms:
(+/-)4-(2-Amino-1-hydroxy-ethyl)-3-fluoro-benzene-1,2-diol 4-(2-Amino-1-hydroxy-ethyl)-3-fluoro-benzene-1,2-diol(2-FNE) | CHEMBL287587
Type:
Small organic molecule
Emp. Form.:
C8H10FNO3
Mol. Mass.:
187.1683
SMILES:
NCC(O)c1ccc(O)c(O)c1F
: