Target
Beta-1 adrenergic receptor
Ligand
BDBM50019061
Substrate
Meas. Tech.
ChEMBL_39325 (CHEMBL653363)
Ki
>3000±n/a nM
Citation
 Adejare, AGusovsky, FPadgett, WCreveling, CRDaly, JWKirk, KL Syntheses and adrenergic activities of ring-fluorinated epinephrines. J Med Chem 31:1972-7 (1988)  
Target
Name:
Beta-1 adrenergic receptor
Synonyms:
ADRB1 adrenergic Beta1
Type:
Enzyme Catalytic Domain
Mol. Mass.:
50540.48
Organism:
GUINEA PIG
Description:
adrenergic Beta1 ADRB1 GUINEA PIG::B0FL73
Residue:
467
  
Inhibitor
Name:
BDBM50019061
Synonyms:
(+/-)4-(2-Amino-1-hydroxy-ethyl)-5-fluoro-benzene-1,2-diol 4-(2-Amino-1-hydroxy-ethyl)-5-fluoro-benzene-1,2-diol(6-FNE) | CHEMBL281232
Type:
Small organic molecule
Emp. Form.:
C8H10FNO3
Mol. Mass.:
187.1683
SMILES:
NCC(O)c1cc(O)c(O)cc1F
: