Target
Phenylethanolamine N-methyltransferase
Ligand
BDBM50405614
Substrate
Meas. Tech.
ChEBML_153308
Ki
4100±n/a nM
Citation
 Grunewald, GLYe, QH Stereochemical aspects of phenylethanolamine analogues as substrates of phenylethanolamine N-methyltransferase. J Med Chem 31:1984-6 (1988)  
Target
Name:
Phenylethanolamine N-methyltransferase
Synonyms:
Noradrenaline N-methyltransferase PNMT_BOVIN | PNMTase
Type:
Enzyme
Mol. Mass.:
30916.97
Organism:
Bos taurus (bovine)
Description:
Residue:
283
  
Inhibitor
Name:
BDBM50405614
Synonyms:
CHEMBL1178569
Type:
Small organic molecule
Emp. Form.:
C10H13N
Mol. Mass.:
147.2169
SMILES:
N[C@H]1CCc2ccccc2C1
: