Target
Aminopeptidase B
Ligand
BDBM50022745
Substrate
Meas. Tech.
ChEBML_35352
Ki
7000±n/a nM
Citation
 Ocain, TDRich, DH Synthesis of sulfur-containing analogues of bestatin. Inhibition of aminopeptidases by alpha-thiolbestatin analogues. J Med Chem 31:2193-9 (1988)  
Target
Name:
Aminopeptidase B
Synonyms:
AMPB_RAT Arginine aminopeptidase Cytosol aminopeptidase IV | Rnpep
Type:
PROTEIN
Mol. Mass.:
72609.93
Organism:
Rattus norvegicus
Description:
ChEMBL_1344423
Residue:
650
  
Inhibitor
Name:
BDBM50022745
Synonyms:
3-Amino-5-methyl-hexane-2-thiol | CHEMBL69814
Type:
Small organic molecule
Emp. Form.:
C7H17NS
Mol. Mass.:
147.282
SMILES:
CC(C)C[C@H](N)C(C)S
: