Target
Aminopeptidase B
Ligand
BDBM50022753
Substrate
Meas. Tech.
ChEBML_35352
Ki
>200000±n/a nM
Citation
 Ocain, TDRich, DH Synthesis of sulfur-containing analogues of bestatin. Inhibition of aminopeptidases by alpha-thiolbestatin analogues. J Med Chem 31:2193-9 (1988)  
Target
Name:
Aminopeptidase B
Synonyms:
AMPB_RAT Arginine aminopeptidase Cytosol aminopeptidase IV | Rnpep
Type:
PROTEIN
Mol. Mass.:
72609.93
Organism:
Rattus norvegicus
Description:
ChEMBL_1344423
Residue:
650
  
Inhibitor
Name:
BDBM50022753
Synonyms:
3-Amino-5-methyl-hexan-2-ol | CHEMBL68511
Type:
Small organic molecule
Emp. Form.:
C7H17NO
Mol. Mass.:
131.216
SMILES:
CC(C)C[C@H](N)C(C)O
: